{"text_format":"1","workbook":"xlsx","n_sheets":4,"sheets":["Start","Max Levy Hearing Notice","MinHearingNotice","Publication_Date_Calculator"],"not_rendered":{"charts":0,"images":0,"macros":1,"external_links":1,"defined_names":374,"comments":0,"pivot_tables":0},"unopened":[],"bounds":{"document_bytes":16777216,"sheet_cells":100000,"rows_first":2000,"rows_last":500,"rows_between":2000,"halvings":0,"cell_chars":16384,"cell_head_chars":4096},"cells_cut":0,"cells_raw":0,"read":"whole","date_system":"1900"}

{"sheet":"Start","index":0,"n_rows":992,"n_cols":29,"rows_kept":992,"cut":false,"hidden":true,"merged":[]}
[null,null,null,null,null,null,null,null,null,null,"2010 Census",null,{"$f":"VLOOKUP('Max Levy Hearing Notice'!$B$2,Start!$C$7:$H$992,6,0)","v":"22G200"},"MAX LEVY"]
[1,2,3,4,5,1,null,null,"ACKLEY",1809,1589,null,null,"CITY #","CODE","CITY NAME","VALUATION","Regular General","Contract for use of Bridge","Opr & Maint publicly owned Transit","Rent, Ins. Maint of Civic Center","Opr & Maint of City owned Civic Center","Planning a Sanitary Disposal Project","Liability, property & self insurance costs","Support of a Local  Emerg.Mgmt.Comm.","Emergency (if general fund at levy limit)","Police & Fire Retirement","FICA & IPERS (if general fund at levy limit)","Other Employee Benefits"]
["num","county","CITY","BENEFITED ","processing ","result",null,null,"ACKWORTH",85,83,null,null,388,"42G388","ACKLEY",40085400,324692,0,0,0,0,0,45500,0,10823,0,69500,91500]
[null,null,"NAME","FIRE DIST","CODE",null,null,null,"ADAIR",839,781,null,null,869,"91G869","ACKWORTH",4943355,12956,0,0,0,0,0,0,0,0,0,0,0]
[null,null,null,null,null,null,null,null,"ADEL",3435,3682,null,null,1,"01G001","ADAIR",25037621,202805,0,0,0,0,0,45500,0,0,0,31500,0]
[1,"Type in you city name first",null," "," "," ",null,null,"AFTON",917,845,null,null,228,"25G228","ADEL",141908535,1149459,0,0,0,0,0,48121,0,38315,0,181618,322205]
[2,"HARDIN & FRANKLIN ","ACKLEY",null,"42-388","HARDIN & FRANKLIN ",null,"42G388","AGENCY",622,638,null,null,846,"88G846","AFTON",16616539,134594,0,0,0,0,0,29124,0,4486,0,12834,12944]
[3,"WARREN","ACKWORTH",null,"91-869","WARREN",null,"91G869","AINSWORTH",524,567,null,null,862,"90G862","AGENCY",14327169,116050,0,0,0,0,0,0,0,0,0,0,0]
[4,"ADAIR & GUTHRIE","ADAIR",null,"01-001","ADAIR & GUTHRIE",null,"01G001","AKRON",1489,1486,null,null,882,"92G882","AINSWORTH",10158629,82285,0,0,0,1371,0,6000,0,0,0,0,0]
[5,"DALLAS","ADEL",null,"25-228","DALLAS",null,"25G228","ALBERT CITY",709,699,null,null,692,"75G692","AKRON",32860106,266167,0,0,0,0,0,84545,0,0,0,68000,0]
[6,"UNION","AFTON",null,"88-846","UNION",null,"88G846","ALBIA",3706,3766,null,null,83,"11G083","ALBERT CITY",23631461,191415,0,0,0,0,0,15015,210,0,0,28960,0]
[7,"WAPELLO","AGENCY",null,"90-862","WAPELLO",null,"90G862","ALBION",592,505,null,null,641,"68G641","ALBIA",91624606,742159,0,0,0,0,0,69000,0,24739,0,214526,265264]
[8,"WASHINGTON","AINSWORTH",null,"92-882","WASHINGTON",null,"92G882","ALBURNETT",559,673,null,null,603,"64G603","ALBION",9934808,80472,0,0,0,0,0,0,0,2682,0,6268,8997]
[9,"PLYMOUTH","AKRON",null,"75-692","PLYMOUTH",null,"75G692","ALDEN",904,787,null,null,537,"57G537","ALBURNETT",24388068,197543,0,0,0,0,0,14300,0,6585,0,9085,8347]
[10,"BUENA VISTA","ALBERT CITY",null,"11-083","BUENA VISTA",null,"11G083","ALEXANDER",165,175,null,null,389,"42G389","ALDEN",19034762,154182,0,0,0,0,0,27447,0,5139,0,30201,25062]
[11,"MONROE","ALBIA",null,"68-641","MONROE",null,"68G641","ALGONA",5741,5560,null,null,330,"35G330","ALEXANDER",2758380,20701,0,0,0,0,0,7500,4250,0,0,2738,791]
[12,"MARSHALL","ALBION",null,"64-603","MARSHALL",null,"64G603","ALLEMAN",439,432,null,null,517,"55G517","ALGONA",263830635,2137028,0,26552,0,0,0,150221,0,0,23830.327500000003,400920,790217]
[13,"LINN","ALBURNETT",null,"57-537","LINN",null,"57G537","ALLERTON",559,501,null,null,712,"77G712","ALLEMAN",23009362,186376,0,0,0,0,0,0,0,0,0,0,22041]
[14,"HARDIN","ALDEN",null,"42-389","HARDIN",null,"42G389","ALLISON",1006,1029,null,null,890,"93G890","ALLERTON",10962164,88794,0,0,0,0,0,11000,0,0,0,8000,4000]
[15,"FRANKLIN","ALEXANDER",1,"35-330","FRANKLIN",null,"35G330","ALTA",1865,1883,null,null,93,"12G093","ALLISON",26915153,218013,0,0,0,0,0,22000,0,0,0,30000,30000]
[16,"KOSSUTH","ALGONA",null,"55-517","KOSSUTH",null,"55G517","ALTA VISTA",286,266,null,null,84,"11G084","ALTA",59875406,484991,0,0,0,0,0,0,0,0,173,53789,95320]
[17,"POLK","ALLEMAN",null,"77-712","POLK",null,"77G712","ALTON",1095,1216,null,null,161,"19G161","ALTA VISTA",4072772,32989,0,0,0,0,0,18000,0,0,0,2000,2500]
[18,"WAYNE","ALLERTON",null,"93-890","WAYNE",null,"93G890","ALTOONA",10345,14541,null,null,798,"84G798","ALTON",60223605,487811,0,0,0,0,0,19780,6561,0,0,0,71828]
[19,"BUTLER","ALLISON",null,"12-093","BUTLER",null,"12G093","ALVORD",187,196,null,null,713,"77G713","ALTOONA",899956888,7289651,0,0,0,0,0,0,0,0,0,1306981,0]
[20,"BUENA VISTA","ALTA",null,"11-084","BUENA VISTA",null,"11G084","AMES",50731,58965,null,null,568,"60G568","ALVORD",7006102,56749,0,0,0,0,0,0,0,0,0,0,0]
[21,"CHICKASAW","ALTA VISTA",null,"19-161","CHICKASAW",null,"19G161","ANAMOSA",5494,5533,null,null,811,"85G811","AMES",3079908598,17016779,0,1934521,0,0,0,0,0,0,2091970,0,0]
[22,"SIOUX","ALTON",null,"84-798","SIOUX",null,"84G798","ANDOVER",87,103,null,null,492,"53G492","ANAMOSA",131485901,1065036,0,0,0,17749,0,226614,0,35501,0,215310,283156]
[23,"POLK","ALTOONA",null,"77-713","POLK",null,"77G713","ANDREW",460,434,null,null,201,"23G201","ANDOVER",1832542,14840,0,0,0,0,0,0,0,0,0,0,0]
[24,"LYON","ALVORD",null,"60-568","LYON",null,"60G568","ANITA",1049,972,null,null,448,"49G448","ANDREW",8132771,60935,0,0,0,0,0,3786,2000,2196,0,7805,2300]
[25,"STORY","AMES",null,"85-811","STORY",null,"85G811","ANKENY",27117,54598,null,null,127,"15G127","ANITA",26607592,215521,0,0,0,3592,0,29500,0,7184,0,28126,31336]
[26,"JONES","ANAMOSA",null,"53-492","JONES",null,"53G492","ANTHON",649,565,null,null,714,"77G714","ANKENY",3549932642,21654589,0,0,0,0,0,0,0,0,2129960,0,0]
[27,"CLINTON","ANDOVER",null,"23-201","CLINTON",null,"23G201","APLINGTON",1054,1128,null,null,926,"97G926","ANTHON",12694691,102827,0,0,0,0,0,10373,0,3420,0,0,0]
[28,"JACKSON","ANDREW",1,"49-448","JACKSON",null,"49G448","ARCADIA",443,484,null,null,94,"12G094","APLINGTON",29137379,236013,0,0,0,0,0,52500,0,0,0,26957,72283]
[29,"CASS","ANITA",null,"15-127","CASS",null,"15G127","ARCHER",126,131,null,null,114,"14G114","ARCADIA",20706334,167721,0,0,0,0,0,15000,0,5591,0,3000,2800]
[30,"POLK","ANKENY",null,"77-714","POLK",null,"77G714","AREDALE",89,74,null,null,658,"71G658","ARCHER",2667168,21604,0,0,0,0,0,0,0,0,0,0,0]
[31,"WOODBURY","ANTHON",null,"97-926","WOODBURY",null,"97G926","ARION",136,108,null,null,95,"12G095","AREDALE",1328701,10762,0,0,0,0,0,9500,0,0,0,1600,0]
[32,"BUTLER","APLINGTON",null,"12-094","BUTLER",null,"12G094","ARISPE",89,100,null,null,215,"24G215","ARION",1995846,16166,0,0,0,0,0,3471,0,0,0,0,0]
[33,"CARROLL","ARCADIA",null,"14-114","CARROLL",null,"14G114","ARLINGTON",490,429,null,null,847,"88G847","ARISPE",2702164,17973,0,0,0,0,0,0,0,0,0,0,0]
[34,"O'BRIEN","ARCHER",null,"71-658","O'BRIEN",null,"71G658","ARMSTRONG",979,926,null,null,309,"33G309","ARLINGTON",8643838,70015,0,0,0,0,0,22000,1407,2334,0,7152,20970]
[35,"BUTLER","AREDALE",null,"12-095","BUTLER",null,"12G095","ARNOLDS PARK",1162,1126,null,null,303,"32G303","ARMSTRONG",27623522,206969,0,0,0,0,0,21599,0,0,0,24000,20320]
[36,"CRAWFORD","ARION",1,"24-215","CRAWFORD",null,"24G215","ARTHUR",245,206,null,null,272,"30G272","ARNOLDS PARK",258691476,1151177,0,0,0,0,0,0,0,0,0,0,0]
[37,"UNION","ARISPE",null,"88-847","UNION",null,"88G847","ASBURY",2450,5451,null,null,436,"47G436","ARTHUR",3621814,29337,0,0,0,0,0,12384,1539,978,0,7805,0]
[38,"FAYETTE","ARLINGTON",null,"33-309","FAYETTE",null,"33G309","ASHTON",461,458,null,null,282,"31G282","ASBURY",228075465,1847411,0,0,0,0,0,0,0,33000,0,0,121000]
[39,"EMMET","ARMSTRONG",1,"32-303","EMMET",null,"32G303","ASPINWALL",58,40,null,null,667,"72G667","ASHTON",11990952,97127,0,0,0,0,0,14000,0,0,0,18500,18000]
[40,"DICKINSON","ARNOLDS PARK",null,"30-272","DICKINSON",null,"30G272","ATALISSA",283,311,null,null,216,"24G216","ASPINWALL",5176605,41929,0,0,0,0,0,1616,0,0,0,0,0]
[41,"IDA","ARTHUR",null,"47-436","IDA",null,"47G436","ATHELSTAN",{"$error":"#N/A"},19,null,null,650,"70G650","ATALISSA",6169563,49973,0,0,0,0,0,0,0,0,0,0,0]
[42,"DUBUQUE","ASBURY",null,"31-282","DUBUQUE",null,"31G282","ATKINS",977,1670,null,null,32,"06G032","ATKINS",68607408,555720,0,0,0,0,0,0,0,0,0,{"$error":"#N/A"},{"$error":"#N/A"}]
[43,"OSCEOLA","ASHTON",null,"72-667","OSCEOLA",null,"72G667","ATLANTIC",7257,7112,null,null,128,"15G128","ATLANTIC",224935230,1821975,0,0,0,0,0,80045,0,60733,20244,787273,0]
[44,"CRAWFORD","ASPINWALL",1,"24-216","CRAWFORD",null,"24G216","AUBURN",296,322,null,null,761,"81G761","AUBURN",5830545,47227,0,0,0,0,0,9000,0,1574,0,8343,19647]
[45,"MUSCATINE","ATALISSA",null,"70-650","MUSCATINE",null,"70G650","AUDUBON",2382,2176,null,null,27,"05G027","AUDUBON",52078219,421834,0,0,0,0,0,85125,0,0,0,150125,336095]
[46,"TAYLOR","ATHELSTAN",null,"87-837","TAYLOR",null,"87G837","AURELIA",1062,1036,null,null,153,"18G153","AURELIA",31560248,255638,0,0,2700,0,0,28750,0,0,8000,43250,0]
[47,"BENTON","ATKINS",null,"06-032","BENTON",null,"06G032","AURORA",194,185,null,null,72,"10G072","AURORA",4005953,32448,0,0,0,0,0,4675,0,0,0,1656,0]
[48,"CASS","ATLANTIC",null,"15-128","CASS",null,"15G128","AVOCA",1610,1506,null,null,729,"78G729","AVOCA",6419218,51996,0,0,0,0,0,0,0,0,0,10097,0]
[49,"SAC","AUBURN",null,"81-761","SAC",null,"81G761","AYRSHIRE",202,143,null,null,683,"74G683","AYRSHIRE",1638085,13268,0,0,0,0,0,0,0,0,0,2500,0]
[50,"AUDUBON","AUDUBON",null,"05-027","AUDUBON",null,"05G027","BADGER",610,561,null,null,898,"94G898","BADGER",13675604,110772,0,0,0,0,0,17890,10669,0,0,16124,0]
[51,"CHEROKEE","AURELIA",null,"18-153","CHEROKEE",null,"18G153","BAGLEY",354,303,null,null,362,"39G362","BAGLEY",4609119,37334,0,0,0,0,0,10000,0,0,0,4100,0]
[52,"BUCHANAN","AURORA",null,"10-072","BUCHANAN",null,"10G072","BALDWIN",127,109,null,null,449,"49G449","BALDWIN",2378056,19262,0,0,0,0,0,4000,299,0,0,0,0]
[53,"POTTAWATTAMIE","AVOCA",null,"78-729","POTTAWATTAMIE",null,"78G729","BALLTOWN",73,68,null,null,283,"31G283","BALLTOWN",3661657,500,0,0,0,0,0,0,0,0,0,0,0]
[54,"PALO ALTO","AYRSHIRE",null,"74-683","PALO ALTO",null,"74G683","BANCROFT",808,732,null,null,518,"55G518","BANCROFT",23971334,194168,0,0,0,0,0,30000,0,6472,0,39099,0]
[55,"WEBSTER","BADGER",null,"94-898","WEBSTER",null,"94G898","BANKSTON",27,25,null,null,284,"31G284","BANKSTON",1095802,0,0,0,0,0,0,0,0,0,0,0,0]
{"$rows_left_out":933}
{"sheet":"Max Levy Hearing Notice","index":1,"n_rows":40,"n_cols":10,"rows_kept":40,"cut":false,"hidden":false,"merged":[[5,1,5,7],[0,2,0,6],[1,2,1,6],[2,1,2,7],[3,3,3,7],[4,3,4,7],[6,1,6,7],[7,1,7,7],[8,1,8,4],[8,5,8,7],[9,1,9,4],[9,5,9,7],[10,1,10,2],[11,1,11,2],[12,1,12,2],[13,1,13,2],[27,1,27,2],[15,1,15,2],[14,1,14,2],[16,1,16,2],[17,1,17,2],[18,1,18,2],[26,1,26,2],[19,1,19,2],[35,1,35,7],[25,1,25,2],[20,1,20,2],[21,1,21,2],[23,1,23,2],[24,1,24,2],[29,1,29,2],[30,1,30,2],[31,1,31,7],[32,1,32,7],[28,1,28,2]]}
[null,"CITY NAME","NOTICE OF PUBLIC HEARING -PROPOSED PROPERTY TAX LEVY",null,null,null,null,"CITY CODE",null,"HELP"]
[null,"Volga","Fiscal Year July 1, 2020 - June 30, 2021",null,null,null,null,{"$f":"IF(ISBLANK($B$2),\"\",VLOOKUP($B$2,Start!$C$7:$E$992,3,0))","v":"22-200"}]
[null,"The City Council will conduct a public hearing on the proposed Fiscal Year City property tax levy as follows:"]
[null,"Meeting Date:","Meeting Time:","Meeting Location:"]
[null,"2020-02-10","6:50pm","Volga City Hall, 505 Washington Street Volga, Iowa 52077"]
[null,"At the public hearing any resident or taxpayer may present objections to, or arguments in favor of the proposed tax levy. "]
[null,"After adoption of the proposed tax levy, the Council will publish notice and hold a hearing on the proposed city budget."]
[]
[null,"City Web Site (if available):",null,null,null,"City Telephone Number:"]
[null,"www.volgacityiowa.com",null,null,null,"563-767-3511"]
[null,"Iowa Department of Management",null," ","Current Year Certified Property Tax","Budget Year Effective Property Tax","Budget Year Proposed Maximum Property Tax","Annual"]
[null,null,null," ","2019/2020","2020/2021**","2020/2021","% CHG"]
[null,"Regular Taxable Valuation",null,1,{"$f":"IFERROR(VLOOKUP(Start!$M$1,Max_Levy_Lookup,3,0),0)","v":4173906},{"$f":"G13","v":4225939},4225939]
[]
[null,"Tax Levies:"]
[null,"Regular General",null,2,{"$f":"IFERROR(VLOOKUP(Start!$M$1,Max_Levy_Lookup,4,0),0)","v":33809},{"$f":"E16","v":33809},34231,{"$f":"IF(ISERROR(I16),\"\",IF(I16>8.1,\"REDUCE LEVY\",\"\"))","v":""},{"$f":"IFERROR(IF(AND(ROUND(G16/($G$13/1000),5)>8.1,ROUND((G16-1)/($G$13/1000),5)<8.1),8.1,ROUND(G16/($G$13/1000),5)),0)","v":8.1}]
[null,"Contract for Use of Bridge",null,3,{"$f":"IFERROR(VLOOKUP(Start!$M$1,Max_Levy_Lookup,5,0),0)","v":0},{"$f":"E17","v":0},0,{"$f":"IF(ISERROR(I17),\"\",IF(I17>0.675,\"REDUCE LEVY\",\"\"))","v":""},{"$f":"IFERROR(IF(AND(ROUND(G17/($G$13/1000),5)>0.675,ROUND((G17-1)/($G$13/1000),5)<0.675),0.675,ROUND(G17/($G$13/1000),5)),0)","v":0}]
[null,"Opr & Maint Publicly Owned Transit",null,4,{"$f":"IFERROR(VLOOKUP(Start!$M$1,Max_Levy_Lookup,6,0),0)","v":0},0,0,{"$f":"IF(ISERROR(I18),\"\",IF(I18>0.95,\"REDUCE LEVY\",\"\"))","v":""},{"$f":"IFERROR(IF(AND(ROUND(G18/($G$13/1000),5)>0.95,ROUND((G18-1)/($G$13/1000),5)<0.95),0.95,ROUND(G18/($G$13/1000),5)),0)","v":0}]
[null,"Rent, Ins. Maint. Of Non-Owned Civ. Ctr.",null,5,{"$f":"IFERROR(VLOOKUP(Start!$M$1,Max_Levy_Lookup,7,0),0)","v":0},0,0,null,{"$f":"IFERROR(ROUND(G19/($G$13/1000),5),0)","v":0}]
[null,"Opr & Maint of City-Owned Civic Center",null,6,{"$f":"IFERROR(VLOOKUP(Start!$M$1,Max_Levy_Lookup,8,0),0)","v":0},0,0,{"$f":"IF(ISERROR(I20),\"\",IF(I20>0.135,\"REDUCE LEVY\",\"\"))","v":""},{"$f":"IFERROR(IF(AND(ROUND(G20/($G$13/1000),5)>0.135,ROUND((G20-1)/($G$13/1000),5)<0.135),0.135,ROUND(G20/($G$13/1000),5)),0)","v":0}]
[null,"Planning a Sanitary Disposal Project",null,7,{"$f":"IFERROR(VLOOKUP(Start!$M$1,Max_Levy_Lookup,9,0),0)","v":0},0,0,{"$f":"IF(ISERROR(I21),\"\",IF(I21>0.0675,\"REDUCE LEVY\",\"\"))","v":""},{"$f":"IFERROR(IF(AND(ROUND(G21/($G$13/1000),5)>0.0675,ROUND((G21-1)/($G$13/1000),5)<0.0675),0.0675,ROUND(G21/($G$13/1000),5)),0)","v":0}]
[null,"Liability, Property & Self-Insurance Costs",null,8,{"$f":"IFERROR(VLOOKUP(Start!$M$1,Max_Levy_Lookup,10,0),0)","v":23125},23125,27000,null,6.3891099999999996]
[null,"Support of Local Emer. Mgmt. Commission",null,9,{"$f":"IFERROR(VLOOKUP(Start!$M$1,Max_Levy_Lookup,11,0),0)","v":0},0,0,null,0]
[null,"Emergency",null,10,{"$f":"IFERROR(VLOOKUP(Start!$M$1,Max_Levy_Lookup,12,0),0)","v":1127},1127,1141,{"$f":"IF(ISERROR(I24),\"\",IF(I24>0.27,\"REDUCE LEVY\",\"\"))","v":""},{"$f":"IFERROR(IF(AND(ROUND(G24/($G$13/1000),5)>0.27,ROUND((G24-1)/($G$13/1000),5)<0.27),0.27,ROUND(G24/($G$13/1000),5)),0)","v":0.27},{"$f":"IF(I24=0,\"\",IF($I$16<>8.1,\"REG GEN NOT AT MAX\",\"\"))","v":""}]
[null,"Police & Fire Retirement",null,11,{"$f":"IFERROR(VLOOKUP(Start!$M$1,Max_Levy_Lookup,13,0),0)","v":0},0,0,null,0]
[null,"FICA & IPERS",null,12,{"$f":"IFERROR(VLOOKUP(Start!$M$1,Max_Levy_Lookup,14,0),0)","v":0},0,8350,null,1.9758899999999999,{"$f":"IF(I26=0,\"\",IF($I$16<>8.1,\"REG GEN NOT AT MAX\",\"\"))","v":""}]
[null,"Other Employee Benefits",null,13,{"$f":"IFERROR(VLOOKUP(Start!$M$1,Max_Levy_Lookup,15,0),0)","v":8900},8900,0,null,0]
[null,null,null," "]
[null,"*Total 384.15A Maximum Tax Levy",null,14,{"$f":"SUM(E16:E27)","v":66961},{"$f":"SUM(F15:F27)","v":66961},{"$f":"SUM(G15:G27)","v":70722},{"$f":"IFERROR((G29-E29)/E29,0)","v":5.6167022595242005E-2}]
[null,"Calculated 384.15A MaximumTax Rate",null,15,{"$f":"IF(E13>0, ROUND(E29/E13*1000,5),0)","v":16.042770000000001},{"$f":"IF(F13>0, ROUND(F29/F13*1000,5),0)","v":15.84524},{"$f":"SUM(I16:I27)","v":16.734999999999999}]
[]
[null,"Explanation of significant increases in the budget:"]
[null,"Levy rate increases are resulting from property/equipment/workman's comp/flood insurance premium increases. "]
[]
[null,"If applicable, the above notice also available online at:"]
[null,"website: www.volgacityiowa.com    facebook page: Volga City Iowa"]
[]
[null,"  *Total city tax rate will also include voted general fund levy, debt service levy, and capital improvement reserve levy"]
[null,"**Budget year effective property tax rate is the rate that would be assessed for these levies if the dollars requested is not changed in the coming"]
[null,"    budget year"]

{"sheet":"MinHearingNotice","index":2,"n_rows":34,"n_cols":8,"rows_kept":34,"cut":false,"hidden":false,"merged":[[5,1,5,7],[0,2,0,6],[1,2,1,6],[2,1,2,7],[3,3,3,7],[4,3,4,7],[6,1,6,7],[7,1,7,4],[7,5,7,7],[8,1,8,4],[8,5,8,7],[9,1,9,2],[10,1,10,2],[11,1,11,2],[12,1,12,2],[13,1,13,2],[26,1,26,2],[27,1,27,7],[28,1,28,7],[30,1,30,7],[3,8,4,8],[21,1,21,2],[22,1,22,2],[23,1,23,2],[24,1,24,2],[25,1,25,2],[14,1,14,2],[15,1,15,2],[16,1,16,2],[17,1,17,2],[18,1,18,2],[19,1,19,2]]}
[null,"CITY NAME","NOTICE OF PUBLIC HEARING -PROPOSED PROPERTY TAX LEVY",null,null,null,null,"CITY CODE"]
[null,{"$f":"'Max Levy Hearing Notice'!$B$2","v":"Volga"},"Fiscal Year July 1, 2020 - June 30, 2021",null,null,null,null,{"$f":"'Max Levy Hearing Notice'!$H$2","v":"22-200"}]
[null,"The City Council will conduct a public hearing on the proposed Fiscal Year City property tax levy as follows:"]
[null,"Meeting Date:","Meeting Time:","Meeting Location:"]
[null,{"$f":"'Max Levy Hearing Notice'!$B$5","v":"2020-02-10"},{"$f":"'Max Levy Hearing Notice'!$C$5","v":"6:50pm"},{"$f":"'Max Levy Hearing Notice'!$D$5:$H$5","v":"Volga City Hall, 505 Washington Street Volga, Iowa 52077"}]
[null,"At the public hearing any resident or taxpayer may present objections to, or arguments in favor of the proposed tax levy. "]
[null,"After adoption of the proposed tax levy, the Council will publish notice and hold a hearing on the proposed city budget."]
[null,"City Web Site (if available):",null,null,null,"City Telephone Number:"]
[null,{"$f":"'Max Levy Hearing Notice'!$B$10:$E$10","v":"www.volgacityiowa.com"},null,null,null,{"$f":"'Max Levy Hearing Notice'!$F$10:$H$10","v":"563-767-3511"}]
[null,"Iowa Department of Management",null," ","Current Year Certified Property Tax","Budget Year Effective Property Tax","Budget Year Proposed Maximum Property Tax","Annual"]
[null,null,null," ","2019/2020","2020/2021**","2020/2021","% CHG"]
[null,"Regular Taxable Valuation",null,1,{"$f":"'Max Levy Hearing Notice'!$E$13","v":4173906},{"$f":"'Max Levy Hearing Notice'!$F$13","v":4225939},{"$f":"'Max Levy Hearing Notice'!$G$13","v":4225939}]
[null,"Tax Levies:"]
[null,"Regular General",null,2,{"$f":"'Max Levy Hearing Notice'!$E$16","v":33809},{"$f":"'Max Levy Hearing Notice'!$F$16","v":33809},{"$f":"'Max Levy Hearing Notice'!$G$16","v":34231},{"$f":"IF(ISERROR(I14),\"\",IF(I14>8.1,\"REDUCE LEVY\",\"\"))","v":""}]
[null,"Contract for Use of Bridge",null,3,{"$f":"'Max Levy Hearing Notice'!$E$17","v":0},{"$f":"'Max Levy Hearing Notice'!$F$17","v":0},{"$f":"'Max Levy Hearing Notice'!$G$17","v":0},{"$f":"IF(ISERROR(I15),\"\",IF(I15>0.675,\"REDUCE LEVY\",\"\"))","v":""}]
[null,"Opr & Maint Publicly Owned Transit",null,4,{"$f":"'Max Levy Hearing Notice'!$E$18","v":0},{"$f":"'Max Levy Hearing Notice'!$F$18","v":0},{"$f":"'Max Levy Hearing Notice'!$G$18","v":0},{"$f":"IF(ISERROR(I16),\"\",IF(I16>0.95,\"REDUCE LEVY\",\"\"))","v":""}]
[null,"Rent, Ins. Maint. Of Non-Owned Civ. Ctr.",null,5,{"$f":"'Max Levy Hearing Notice'!$E$19","v":0},{"$f":"'Max Levy Hearing Notice'!$F$19","v":0},{"$f":"'Max Levy Hearing Notice'!$G$19","v":0}]
[null,"Opr & Maint of City-Owned Civic Center",null,6,{"$f":"'Max Levy Hearing Notice'!$E$20","v":0},{"$f":"'Max Levy Hearing Notice'!$F$20","v":0},{"$f":"'Max Levy Hearing Notice'!$G$20","v":0},{"$f":"IF(ISERROR(I18),\"\",IF(I18>0.135,\"REDUCE LEVY\",\"\"))","v":""}]
[null,"Planning a Sanitary Disposal Project",null,7,{"$f":"'Max Levy Hearing Notice'!$E$21","v":0},{"$f":"'Max Levy Hearing Notice'!$F$21","v":0},{"$f":"'Max Levy Hearing Notice'!$G$21","v":0},{"$f":"IF(ISERROR(I19),\"\",IF(I19>0.0675,\"REDUCE LEVY\",\"\"))","v":""}]
[null,"Liability, Property & Self-Insurance Costs",null,8,{"$f":"'Max Levy Hearing Notice'!$E$22","v":23125},{"$f":"'Max Levy Hearing Notice'!$F$22","v":23125},{"$f":"'Max Levy Hearing Notice'!$G$22","v":27000}]
[null,"Support of Local Emer. Mgmt. Commission",null,9,{"$f":"'Max Levy Hearing Notice'!$E$23","v":0},{"$f":"'Max Levy Hearing Notice'!$F$23","v":0},{"$f":"'Max Levy Hearing Notice'!$G$23","v":0}]
[null,"Emergency",null,10,{"$f":"'Max Levy Hearing Notice'!$E$24","v":1127},{"$f":"'Max Levy Hearing Notice'!$F$24","v":1127},{"$f":"'Max Levy Hearing Notice'!$G$24","v":1141},{"$f":"IF(ISERROR(I22),\"\",IF(I22>0.27,\"REDUCE LEVY\",\"\"))","v":""}]
[null,"Police & Fire Retirement",null,11,{"$f":"'Max Levy Hearing Notice'!$E$25","v":0},{"$f":"'Max Levy Hearing Notice'!$F$25","v":0},{"$f":"'Max Levy Hearing Notice'!$G$25","v":0}]
[null,"FICA & IPERS",null,12,{"$f":"'Max Levy Hearing Notice'!$E$26","v":0},{"$f":"'Max Levy Hearing Notice'!$F$26","v":0},{"$f":"'Max Levy Hearing Notice'!$G$26","v":8350}]
[null,"Other Employee Benefits",null,13,{"$f":"'Max Levy Hearing Notice'!$E$27","v":8900},{"$f":"'Max Levy Hearing Notice'!$F$27","v":8900},{"$f":"'Max Levy Hearing Notice'!$G$27","v":0}]
[null,"*Total 384.15A Maximum Tax Levy",null,14,{"$f":"'Max Levy Hearing Notice'!$E$29","v":66961},{"$f":"'Max Levy Hearing Notice'!$F$29","v":66961},{"$f":"'Max Levy Hearing Notice'!$G$29","v":70722},{"$f":"'Max Levy Hearing Notice'!$H$29","v":5.6167022595242005E-2}]
[null,"Calculated 384.15A MaximumTax Rate",null,15,{"$f":"'Max Levy Hearing Notice'!$E$30","v":16.042770000000001},{"$f":"'Max Levy Hearing Notice'!$F$30","v":15.84524},{"$f":"'Max Levy Hearing Notice'!$G$30","v":16.734999999999999}]
[null,"Explanation of significant increases in the budget:"]
[null,{"$f":"'Max Levy Hearing Notice'!$B$33:$H$33","v":"Levy rate increases are resulting from property/equipment/workman's comp/flood insurance premium increases. "}]
[null,"If applicable, the above notice also available online at:"]
[null,{"$f":"'Max Levy Hearing Notice'!$B$36:$H$36","v":"website: www.volgacityiowa.com    facebook page: Volga City Iowa"}]
[null,"  *Total city tax rate will also include voted general fund levy, debt service levy, and capital improvement reserve levy"]
[null,"**Budget year effective property tax rate is the rate that would be assessed for these levies if the dollars requested is not changed in the coming"]
[null,"    budget year"]

{"sheet":"Publication_Date_Calculator","index":3,"n_rows":8,"n_cols":6,"rows_kept":8,"cut":false,"hidden":false,"merged":[]}
[]
[]
[null,"PUBLICATION DATE CALCULATOR"]
[]
[null,null,"Earliest Publication Date",null,{"$f":"IF(E8<>\"\",E8-20,\"\")","v":""}]
[null,null,"Latest Publication Date",null,{"$f":"IF(E8<>\"\",E8-10,\"\")","v":""}]
[]
[null,null,"Proposed Hearing Date",null,null,"<== Enter Date"]